{"text_format":"1","workbook":"xlsx","n_sheets":9,"sheets":["0.ΕΙΣΑΓΩΓΗ","1α.ΔΕΛΤΙΟ ΔΕΔΟΜΕΝΩΝ","1β.ΜΞΔΠ","2.ΒΑΣΙΚΕΣ ΤΙΜΕΣ","3α.ΑΠΟΤΕΛΕΣΜΑΤΑ","3β.ΤΕΚΜΗΡΙΩΣΗ","PS DATA","CS DATA","5.ΥΠΟΛΟΓΙΣΜΟΙ"],"not_rendered":{"charts":0,"images":3,"macros":1,"external_links":0,"defined_names":4,"comments":0,"pivot_tables":0},"unopened":[],"bounds":{"document_bytes":16777216,"sheet_cells":100000,"rows_first":2000,"rows_last":500,"rows_between":2000,"halvings":0,"cell_chars":16384,"cell_head_chars":4096},"cells_cut":0,"cells_raw":0,"read":"whole","date_system":"1900"}

{"sheet":"0.ΕΙΣΑΓΩΓΗ","index":0,"n_rows":0,"n_cols":0,"rows_kept":0,"cut":false,"hidden":false,"merged":[]}

{"sheet":"1α.ΔΕΛΤΙΟ ΔΕΔΟΜΕΝΩΝ","index":1,"n_rows":43,"n_cols":46,"rows_kept":43,"cut":false,"hidden":false,"merged":[[0,18,0,19],[0,5,0,8],[0,9,0,10],[0,2,1,2],[0,1,1,1],[0,0,1,0],[0,14,0,15],[0,11,0,13],[0,16,0,17],[0,4,1,4],[0,3,1,3]]}
["Α/Α","Δασικό είδος","Συνολική έκταση (ha)","ΒΕ","Βαθμός εδαφο-κάλυψης (%)","ΜΗ ΞΥΛΩΔΗ ΔΑΣΙΚΑ ΠΡΟΪΟΝΤΑ",null,null,null,"ΕΚΤΑΣΗ ΠΟΥ ΔΕΝ ΕΠΙΤΡΕΠΕΤΑΙ ΜΟΝΙΜΑ",null,"Μέση κλίση (%)",null,null,"Υψόμετρο",null,"ΔΙΑΒΡΩΣΗ ΕΔΑΦΟΥΣ: Κατηγορίες",null,"ΔΕΣΜΕΥΣΗ ΑΝΘΡΑΚΑ ΚΑΙ ΒΙΟΠΟΙΚΙΛΟΤΗΤΑΣ: Κατηγορίες"]
[null,null,null,null,null,"Ρη-τίνη","Μανι-τάρια","Μέλι","Λοι-πά","Βόσκηση (ha)","Κυνήγι (ha)","από GIS","επιλογή","από τύπο","max","min","Πετρώματος","Βλάστησης","Για συν/τή BEF","Για συν/τη φυσικότητας",null,null,"Μέλι","Δασικά είδη",null,"Γεωλογικοί σχηματισμοί",null,"Κατηγορίες συντ/τη BEF",null,"Κατηγορίες συντ/τη φυσικότητας Ν",null,null,{"$f":"IF(OR(B3=\"Ελάτη\",B3=\"Ερυθρελάτη\",B3=\"Πεύκη Χαλέπιος ή Τραχεία\",B3=\"Πεύκη Λοιπά\",B3=\"Αείφυλλα πλατύφυλλα\"),$AI$4:$AK$4,IF(OR(B3=\"Οξυά\",B3=\"Δρυς\",B3=\"Λοιπά πλατύφυλλα\"),$AI$8:$AJ$8,$AI$15:$AK$15))","v":{"$error":"#VALUE!"}}]
[1,null,null,{"$f":"IF(E3=\"\",1,VLOOKUP(E3,AB$15:AC$23,2,FALSE))","v":1},{"$f":"IF(C3>0,\"90-100%\",\"\")","v":""},{"$f":"IF(B3=\"\",0,IF(B3=\"Πεύκη χαλέπιος ή τραχεία\",TRUE,FALSE))","v":0},{"$f":"IF(B3=\"\",0,NOT(OR(B3=\"Φρύγανα\",B3=\"Χορτολίβαδα>800 m\",B3=\"Χορτολίβαδα<800 m\",B3=\"Άγονη / βραχώδης έκταση\",F3=TRUE)))","v":0},{"$f":"IF(B3=\"\",0,NOT(OR(C3=\"Άγονη / βραχώδης έκταση\")))","v":0},"ΝΑΙ",null,null,null,{"$f":"IF(L3=\"\",IF(N3=0,0,IF(N3>90,\">90%\",IF(N3>60,\"60-90%\",IF(N3>40,\"40-60%\",IF(N3>25,\"25-40%\",\"0-25%\"))))),L3)","v":0},{"$f":"IF(C3>0,IF(L3=\"\",(O3-P3)/C3^0.5,\"Δ/Α\"),0)","v":0},null,null,{"$f":"IF(B3=\"Άγονη / βραχώδης έκταση\",\"Δεν απαιτείται\",\"\")","v":""},{"$f":"IF(B3=\"Άγονη / βραχώδης έκταση\",\"Επιφάνεια χωρίς φυτοκάλυψη\",\"\")","v":""},{"$f":"IF(OR(B3=\"Φρύγανα\",B3=\"Χορτολίβαδα>800 m\",B3=\"Χορτολίβαδα<800 m\",B3=\"Άγονη / βραχώδης έκταση\"),\"ΔΕΝ ΑΠΑΙΤΕΙΤΑΙ\",\"\")","v":""},{"$f":"IF(OR(B3=\"Φρύγανα\",B3=\"Χορτολίβαδα>800 m\",B3=\"Χορτολίβαδα<800 m\",B3=\"Άγονη / βραχώδης έκταση\"),\"Θάμνοι και Μεσογειακά maquis\",\"\")","v":""},null,null,{"$f":"IF(B3=\"Άγονη / βραχώδης έκταση\",0.3,1)","v":1},{"$f":"'2.ΒΑΣΙΚΕΣ ΤΙΜΕΣ'!A6","v":"Ελάτη"},null,"Σκληρά πετρώματα, ανθεκτικά στη διάβρωση",null,"A (Δάση σφενδάμου\nΥγρόφιλα παρόχθια δάση\nΥψηλά δάση δρυός σε χαμηλά υψόμετρα\nΥψηλά δάση οξυάς ή σημύδας)",null,"Φυτείες ξενικών ειδών",null,null,null,"ΕΙΔΟΣ ΚΑΙ ΔΙΑΒΡΩΣΗ","Μικτές δασοσυστάδες και πυκνοί θαμνώνες ή δασοσυστάδες αραιές με υπόροφο ","Δασοσυστάδες κωνοφόρων με υπόροφο ασθενή ή θαμνώνες όχι σύμπυκνοι ","Δασοσυστάδες και θαμνώνες υποβαθμισμένοι, λιβάδια ","Λιβάδια και εδάφη καλλιεργούμενα, υποβαθμισμένα ","Επιφάνεια χωρίς φυτοκάλυψη "]
[2,null,null,{"$f":"IF(E4=\"\",1,VLOOKUP(E4,AB$15:AC$23,2,FALSE))","v":1},"",{"$f":"IF(B4=\"\",0,IF(B4=\"Πεύκη χαλέπιος ή τραχεία\",TRUE,FALSE))","v":0},{"$f":"IF(B4=\"\",0,NOT(OR(B4=\"Φρύγανα\",B4=\"Χορτολίβαδα>800 m\",B4=\"Χορτολίβαδα<800 m\",B4=\"Άγονη / βραχώδης έκταση\",F4=TRUE)))","v":0},{"$f":"IF(B4=\"\",0,NOT(OR(C4=\"Άγονη / βραχώδης έκταση\")))","v":0},null,null,null,null,{"$f":"IF(L4=\"\",IF(N4=0,0,IF(N4>90,\">90%\",IF(N4>60,\"60-90%\",IF(N4>40,\"40-60%\",IF(N4>25,\"25-40%\",\"0-25%\"))))),L4)","v":0},0,null,null,{"$f":"IF(B4=\"Άγονη / βραχώδης έκταση\",\"Δεν απαιτείται\",\"\")","v":""},{"$f":"IF(B4=\"Άγονη / βραχώδης έκταση\",\"Επιφάνεια χωρίς φυτοκάλυψη\",\"\")","v":""},{"$f":"IF(OR(B4=\"Φρύγανα\",B4=\"Χορτολίβαδα>800 m\",B4=\"Χορτολίβαδα<800 m\",B4=\"Άγονη / βραχώδης έκταση\"),\"ΔΕΝ ΑΠΑΙΤΕΙΤΑΙ\",\"\")","v":""},{"$f":"IF(OR(B4=\"Φρύγανα\",B4=\"Χορτολίβαδα>800 m\",B4=\"Χορτολίβαδα<800 m\",B4=\"Άγονη / βραχώδης έκταση\"),\"Θάμνοι και Μεσογειακά maquis\",\"\")","v":""},null,null,{"$f":"IF(B4=\"Άγονη / βραχώδης έκταση\",0.3,1)","v":1},{"$f":"'2.ΒΑΣΙΚΕΣ ΤΙΜΕΣ'!A7","v":"Ερυθρελάτη"},null,"Πετρώματα μετρίως ανθεκτικά στη διάβρωση ",null,"B (Υψηλά δάση δρυός (Q. petreae, Q.pubescens, Q.cerris)\nΑειθαλή υψηλά δάση δρυός)",null,"Μονοκαλλιέργεια πρεμνοφυών δασών που διαχειρίζονται τακτικά  (ηλικία μικρότερη 1.5t*)",null,null,null,"Ελάτη","Μικτές δασοσυστάδες και πυκνοί θαμνώνες ή δασοσυστάδες αραιές με υπόροφο ","Δασοσυστάδες κωνοφόρων με υπόροφο ασθενή ή θαμνώνες όχι σύμπυκνοι ","Δασοσυστάδες και θαμνώνες υποβαθμισμένοι, λιβάδια "]
[3,null,null,1,"",0,0,0,null,null,null,null,0,0,null,null,"",{"$f":"IF(B5=\"Άγονη / βραχώδης έκταση\",\"Δεν απαιτείται\",\"\")","v":""},"","",null,null,1,"Πεύκη Χαλέπιος ή Τραχεία",null,"Εύθρυπτα πετρώματα ",null,"C (Δάση ερυθρελάτης ή ελάτης\nΜεικτά δάση ελάτης και ερυθρελάτης\nΔάση δασικής ή μαύρης πεύκης)",null,"Μικτά πρεμνοφυή δάση που διαχειρίζονται τακτικά (ηλικία μικρότερη  1.5t*)",null,null,null,"Ερυθρελάτη","Μικτές δασοσυστάδες και πυκνοί θαμνώνες ή δασοσυστάδες αραιές με υπόροφο ","Δασοσυστάδες κωνοφόρων με υπόροφο ασθενή ή θαμνώνες όχι σύμπυκνοι ","Δασοσυστάδες και θαμνώνες υποβαθμισμένοι, λιβάδια "]
[4,null,null,1,"",0,0,0,null,null,null,null,0,0,null,null,"","","","",null,null,1,"Πεύκη λοιπά",null,"Αποθέσεις, μορένες, άργιλοι, ψαμμόλιθοι και άλλα ανθεκτικά πετρώματα",null,"D (Λοφώδη και επίπεδα δάση δασικής πεύκης\nΔάση τραχείας και λευκόδερμου πεύκης \nΛοφώδη δάση μαύρης πεύκης\nΜεσογειακά δάση πεύκης\nΆλλα δάση κωνοφόρων)",null,"Θάμνοι και Μεσογειακά maquis",null,null,null,"Πεύκη Χαλέπιος ή Τραχεία","Μικτές δασοσυστάδες και πυκνοί θαμνώνες ή δασοσυστάδες αραιές με υπόροφο ","Δασοσυστάδες κωνοφόρων με υπόροφο ασθενή ή θαμνώνες όχι σύμπυκνοι ","Δασοσυστάδες και θαμνώνες υποβαθμισμένοι, λιβάδια "]
{"$rows_left_out":38}
{"sheet":"1β.ΜΞΔΠ","index":2,"n_rows":38,"n_cols":16,"rows_kept":38,"cut":false,"hidden":false,"merged":[[26,0,26,3],[0,13,1,13],[1,1,2,1],[1,0,2,0],[0,0,0,6],[0,11,1,11],[0,12,1,12],[1,6,2,6]]}
["ΔΕΛΤΙΟ ΚΑΤΑΓΡΑΦΗΣ ΛΟΙΠΩΝ ΜΗ ΞΥΛΩΔΩΝ ΔΑΣΙΚΩΝ ΠΡΟΪΟΝΤΩΝ",null,null,null,null,null,null,null,null,null,null,"ΕΙΔΟΣ","ΜΟΝΑΔΑ","ΠΟΣΟΤΗΤΑ (ΜΕΣΟΣ ΕΤΗΣΙΟΣ)","ΤΙΜΗ","ΑΞΙΑ"]
["Προϊόν","μ/μ","Ποσότητα","Τιμή","Έκταση","Αξία","Παρατηρήσεις",null,null,null,null,null,null,null,"€/μονάδα","€"]
[null,null,"ανά ha","€ ανά μ/μ","ha","€",null,null,null,null,{"$f":"'1α.ΔΕΛΤΙΟ ΔΕΔΟΜΕΝΩΝ'!C23","v":0},"αγριοτριανταφυλλιάς καρποί","kgr.",41.67,0.64,26.57]
[null,{"$f":"IF(A4=\"\",\"\",VLOOKUP(A4,L:M,2,FALSE))","v":""},null,{"$f":"IF(A4=\"\",0,VLOOKUP(A4,L:O,4,FALSE))","v":0},null,{"$f":"C4*D4*E4","v":0},{"$f":"IF(F4=0,\"\",IF(F4/E4>500,\"ΠΡΟΣΟΧΗ! Υπερβολικά υψηλή τιμή\",\"\"))","v":""},null,null,null,null,"άνθη φιλύρας","kgr.",1.75,4.2,7.35]
[null,{"$f":"IF(A5=\"\",\"\",VLOOKUP(A5,L:M,2,FALSE))","v":""},null,{"$f":"IF(A5=\"\",0,VLOOKUP(A5,L:O,4,FALSE))","v":0},null,{"$f":"C5*D5*E5","v":0},{"$f":"IF(F5=0,\"\",IF(F5/E5>500,\"ΠΡΟΣΟΧΗ! Υπερβολικά υψηλή τιμή\",\"\"))","v":""},null,null,null,null,"βελανίδια","kgr."]
[null,"",null,0,null,0,{"$f":"IF(F6=0,\"\",IF(F6/E6>500,\"ΠΡΟΣΟΧΗ! Υπερβολικά υψηλή τιμή\",\"\"))","v":""},null,null,null,null,"δαδί","kgr.",11622.67,0.16,1859.5]
{"$rows_left_out":33}
{"sheet":"2.ΒΑΣΙΚΕΣ ΤΙΜΕΣ","index":3,"n_rows":89,"n_cols":13,"rows_kept":89,"cut":false,"hidden":false,"merged":[[2,0,2,9],[52,0,52,5],[0,0,0,7],[68,2,68,3],[73,0,73,1],[61,0,61,10],[3,10,4,10],[20,4,20,8],[19,0,19,8],[35,3,38,3],[34,4,34,8],[33,0,33,8],[3,1,3,3],[3,0,4,0],[3,4,3,9],[35,4,35,8]]}
["2. ΒΑΣΙΚΕΣ ΤΙΜΕΣ"]
[]
["2.1 ΠΑΡΑΓΩΓΗ ΞΥΛΕΙΑΣ"]
["Δασοπονικό είδος","MAI (m3/ha/yr)",null,null,"Μέση περίτροπη προσαύξηση (Πίνακες Παραγωγής) (p=0,7)",null,null,null,null,null,"Τιμή πρέμνου (€/m3)"]
[null,"Απογρ. Δασών (1992)","Επεξεργ. Στοιχείων Δασ.Υπηρ.","Τιμές χρήστη","ΠΤ Ι","ΠΤ ΙΙ","ΠΤ ΙΙΙ","ΠΤ ΙV","ΠΤ V","Παρατηρήσεις"]
["Ελάτη",1.74,5.2,{"$f":"C6","v":5.2},null,null,null,null,null,"Διαχ/κή μελέτη ΠΔ Περτουλίου 4,48 m3/ha",20.39]
{"$rows_left_out":84}
{"sheet":"3α.ΑΠΟΤΕΛΕΣΜΑΤΑ","index":4,"n_rows":29,"n_cols":14,"rows_kept":29,"cut":false,"hidden":false,"merged":[[0,10,1,10],[0,0,1,0],[27,7,27,8]]}
["Α/Α","Παραγωγή ξύλου","Μη ξυλώδη δασικά προϊόντα","Βόσκηση","Κυνήγι","Αναψυχή","Προστασία εδάφους","Αποθήκευση άνθρακα","Βιοποικιλότητα","Ζημίες από πυρκαγιές","Σύνολο",null,null,"επιμερισμός"]
[null,"Vw","Vnfwp","Vg","Vh","Vr","Vps","Vcs","Vb","Df",null,null,null,"λοιπ.ΜΞΔΠ"]
[1,{"$f":"IF('1α.ΔΕΛΤΙΟ ΔΕΔΟΜΕΝΩΝ'!B3=\"\",0,IF('1α.ΔΕΛΤΙΟ ΔΕΔΟΜΕΝΩΝ'!C3>0,VLOOKUP('1α.ΔΕΛΤΙΟ ΔΕΔΟΜΕΝΩΝ'!B3,'2.ΒΑΣΙΚΕΣ ΤΙΜΕΣ'!A$6:D$18,4,FALSE)*VLOOKUP('1α.ΔΕΛΤΙΟ ΔΕΔΟΜΕΝΩΝ'!B3,'2.ΒΑΣΙΚΕΣ ΤΙΜΕΣ'!A$6:K$18,11,FALSE),0)*'1α.ΔΕΛΤΙΟ ΔΕΔΟΜΕΝΩΝ'!C3*'1α.ΔΕΛΤΙΟ ΔΕΔΟΜΕΝΩΝ'!D3)","v":0},{"$f":"'1α.ΔΕΛΤΙΟ ΔΕΔΟΜΕΝΩΝ'!F3*'2.ΒΑΣΙΚΕΣ ΤΙΜΕΣ'!C$22*'2.ΒΑΣΙΚΕΣ ΤΙΜΕΣ'!D$22*'1α.ΔΕΛΤΙΟ ΔΕΔΟΜΕΝΩΝ'!C3+'1α.ΔΕΛΤΙΟ ΔΕΔΟΜΕΝΩΝ'!C3*'1α.ΔΕΛΤΙΟ ΔΕΔΟΜΕΝΩΝ'!G3*'2.ΒΑΣΙΚΕΣ ΤΙΜΕΣ'!C$25*'2.ΒΑΣΙΚΕΣ ΤΙΜΕΣ'!D$25+'1α.ΔΕΛΤΙΟ ΔΕΔΟΜΕΝΩΝ'!H3*'1α.ΔΕΛΤΙΟ ΔΕΔΟΜΕΝΩΝ'!C3*'2.ΒΑΣΙΚΕΣ ΤΙΜΕΣ'!C$27*'2.ΒΑΣΙΚΕΣ ΤΙΜΕΣ'!D$27*'1α.ΔΕΛΤΙΟ ΔΕΔΟΜΕΝΩΝ'!W3+N3","v":0},{"$f":"IF('1α.ΔΕΛΤΙΟ ΔΕΔΟΜΕΝΩΝ'!B3=\"\",0,VLOOKUP('1α.ΔΕΛΤΙΟ ΔΕΔΟΜΕΝΩΝ'!B3,'2.ΒΑΣΙΚΕΣ ΤΙΜΕΣ'!A$36:B$51,2,FALSE)*('1α.ΔΕΛΤΙΟ ΔΕΔΟΜΕΝΩΝ'!C3-'1α.ΔΕΛΤΙΟ ΔΕΔΟΜΕΝΩΝ'!J3))","v":0},{"$f":"'2.ΒΑΣΙΚΕΣ ΤΙΜΕΣ'!D$36*0.7*('1α.ΔΕΛΤΙΟ ΔΕΔΟΜΕΝΩΝ'!C3-'1α.ΔΕΛΤΙΟ ΔΕΔΟΜΕΝΩΝ'!K3)","v":0},{"$f":"IF('1α.ΔΕΛΤΙΟ ΔΕΔΟΜΕΝΩΝ'!B3=\"\",0,VLOOKUP('1α.ΔΕΛΤΙΟ ΔΕΔΟΜΕΝΩΝ'!B3,'2.ΒΑΣΙΚΕΣ ΤΙΜΕΣ'!A$36:C$51,3,FALSE)*'1α.ΔΕΛΤΙΟ ΔΕΔΟΜΕΝΩΝ'!C3)","v":0},{"$f":"(IF(OR('1α.ΔΕΛΤΙΟ ΔΕΔΟΜΕΝΩΝ'!M3=\"\",'1α.ΔΕΛΤΙΟ ΔΕΔΟΜΕΝΩΝ'!Q3=\"\",'1α.ΔΕΛΤΙΟ ΔΕΔΟΜΕΝΩΝ'!R3=\"\",'1α.ΔΕΛΤΙΟ ΔΕΔΟΜΕΝΩΝ'!R3=\"Επιφάνεια χωρίς φυτοκάλυψη \"),0,IF('1α.ΔΕΛΤΙΟ ΔΕΔΟΜΕΝΩΝ'!M3=0,0,VLOOKUP('1α.ΔΕΛΤΙΟ ΔΕΔΟΜΕΝΩΝ'!M3&'1α.ΔΕΛΤΙΟ ΔΕΔΟΜΕΝΩΝ'!Q3&'1α.ΔΕΛΤΙΟ ΔΕΔΟΜΕΝΩΝ'!R3,'PS DATA'!D:E,2,FALSE)*'1α.ΔΕΛΤΙΟ ΔΕΔΟΜΕΝΩΝ'!C3*'2.ΒΑΣΙΚΕΣ ΤΙΜΕΣ'!B$54)))","v":0},{"$f":"IF('1α.ΔΕΛΤΙΟ ΔΕΔΟΜΕΝΩΝ'!B3=\"\",0,VLOOKUP('1α.ΔΕΛΤΙΟ ΔΕΔΟΜΕΝΩΝ'!B3,'CS DATA'!D$2:H$13,5,FALSE)*'1α.ΔΕΛΤΙΟ ΔΕΔΟΜΕΝΩΝ'!D3*'1α.ΔΕΛΤΙΟ ΔΕΔΟΜΕΝΩΝ'!C3*'2.ΒΑΣΙΚΕΣ ΤΙΜΕΣ'!D$70)*IF('1α.ΔΕΛΤΙΟ ΔΕΔΟΜΕΝΩΝ'!S3=\"\",0,VLOOKUP('1α.ΔΕΛΤΙΟ ΔΕΔΟΜΕΝΩΝ'!S3,'CS DATA'!A$1:B$13,2,FALSE))","v":0},{"$f":"IF('1α.ΔΕΛΤΙΟ ΔΕΔΟΜΕΝΩΝ'!T3=\"\",0,VLOOKUP('1α.ΔΕΛΤΙΟ ΔΕΔΟΜΕΝΩΝ'!T3,'2.ΒΑΣΙΚΕΣ ΤΙΜΕΣ'!E$64:F$74,2,FALSE)*'1α.ΔΕΛΤΙΟ ΔΕΔΟΜΕΝΩΝ'!C3)*'2.ΒΑΣΙΚΕΣ ΤΙΜΕΣ'!D$71","v":0},{"$f":"IF('1α.ΔΕΛΤΙΟ ΔΕΔΟΜΕΝΩΝ'!B3=\"\",0,VLOOKUP('1α.ΔΕΛΤΙΟ ΔΕΔΟΜΕΝΩΝ'!B3,'2.ΒΑΣΙΚΕΣ ΤΙΜΕΣ'!A$76:B$89,2,FALSE)*'1α.ΔΕΛΤΙΟ ΔΕΔΟΜΕΝΩΝ'!C3)","v":0},{"$f":"SUM(B3:I3)-J3","v":0},null,null,{"$f":"IF('1α.ΔΕΛΤΙΟ ΔΕΔΟΜΕΝΩΝ'!C$23=0,0,'1β.ΜΞΔΠ'!F25*'1α.ΔΕΛΤΙΟ ΔΕΔΟΜΕΝΩΝ'!C3/'1α.ΔΕΛΤΙΟ ΔΕΔΟΜΕΝΩΝ'!C$23)","v":0}]
[2,{"$f":"IF('1α.ΔΕΛΤΙΟ ΔΕΔΟΜΕΝΩΝ'!B4=\"\",0,IF('1α.ΔΕΛΤΙΟ ΔΕΔΟΜΕΝΩΝ'!C4>0,VLOOKUP('1α.ΔΕΛΤΙΟ ΔΕΔΟΜΕΝΩΝ'!B4,'2.ΒΑΣΙΚΕΣ ΤΙΜΕΣ'!A$6:D$18,4,FALSE)*VLOOKUP('1α.ΔΕΛΤΙΟ ΔΕΔΟΜΕΝΩΝ'!B4,'2.ΒΑΣΙΚΕΣ ΤΙΜΕΣ'!A$6:K$18,11,FALSE),0)*'1α.ΔΕΛΤΙΟ ΔΕΔΟΜΕΝΩΝ'!C4*'1α.ΔΕΛΤΙΟ ΔΕΔΟΜΕΝΩΝ'!D4)","v":0},{"$f":"'1α.ΔΕΛΤΙΟ ΔΕΔΟΜΕΝΩΝ'!F4*'2.ΒΑΣΙΚΕΣ ΤΙΜΕΣ'!C$22*'2.ΒΑΣΙΚΕΣ ΤΙΜΕΣ'!D$22*'1α.ΔΕΛΤΙΟ ΔΕΔΟΜΕΝΩΝ'!C4+'1α.ΔΕΛΤΙΟ ΔΕΔΟΜΕΝΩΝ'!C4*'1α.ΔΕΛΤΙΟ ΔΕΔΟΜΕΝΩΝ'!G4*'2.ΒΑΣΙΚΕΣ ΤΙΜΕΣ'!C$25*'2.ΒΑΣΙΚΕΣ ΤΙΜΕΣ'!D$25+'1α.ΔΕΛΤΙΟ ΔΕΔΟΜΕΝΩΝ'!H4*'1α.ΔΕΛΤΙΟ ΔΕΔΟΜΕΝΩΝ'!C4*'2.ΒΑΣΙΚΕΣ ΤΙΜΕΣ'!C$27*'2.ΒΑΣΙΚΕΣ ΤΙΜΕΣ'!D$27*'1α.ΔΕΛΤΙΟ ΔΕΔΟΜΕΝΩΝ'!W4+N4","v":0},{"$f":"IF('1α.ΔΕΛΤΙΟ ΔΕΔΟΜΕΝΩΝ'!B4=\"\",0,VLOOKUP('1α.ΔΕΛΤΙΟ ΔΕΔΟΜΕΝΩΝ'!B4,'2.ΒΑΣΙΚΕΣ ΤΙΜΕΣ'!A$36:B$51,2,FALSE)*('1α.ΔΕΛΤΙΟ ΔΕΔΟΜΕΝΩΝ'!C4-'1α.ΔΕΛΤΙΟ ΔΕΔΟΜΕΝΩΝ'!J4))","v":0},{"$f":"'2.ΒΑΣΙΚΕΣ ΤΙΜΕΣ'!D$36*0.7*('1α.ΔΕΛΤΙΟ ΔΕΔΟΜΕΝΩΝ'!C4-'1α.ΔΕΛΤΙΟ ΔΕΔΟΜΕΝΩΝ'!K4)","v":0},{"$f":"IF('1α.ΔΕΛΤΙΟ ΔΕΔΟΜΕΝΩΝ'!B4=\"\",0,VLOOKUP('1α.ΔΕΛΤΙΟ ΔΕΔΟΜΕΝΩΝ'!B4,'2.ΒΑΣΙΚΕΣ ΤΙΜΕΣ'!A$36:C$51,3,FALSE)*'1α.ΔΕΛΤΙΟ ΔΕΔΟΜΕΝΩΝ'!C4)","v":0},{"$f":"(IF(OR('1α.ΔΕΛΤΙΟ ΔΕΔΟΜΕΝΩΝ'!M4=\"\",'1α.ΔΕΛΤΙΟ ΔΕΔΟΜΕΝΩΝ'!Q4=\"\",'1α.ΔΕΛΤΙΟ ΔΕΔΟΜΕΝΩΝ'!R4=\"\",'1α.ΔΕΛΤΙΟ ΔΕΔΟΜΕΝΩΝ'!R4=\"Επιφάνεια χωρίς φυτοκάλυψη \"),0,IF('1α.ΔΕΛΤΙΟ ΔΕΔΟΜΕΝΩΝ'!M4=0,0,VLOOKUP('1α.ΔΕΛΤΙΟ ΔΕΔΟΜΕΝΩΝ'!M4&'1α.ΔΕΛΤΙΟ ΔΕΔΟΜΕΝΩΝ'!Q4&'1α.ΔΕΛΤΙΟ ΔΕΔΟΜΕΝΩΝ'!R4,'PS DATA'!D:E,2,FALSE)*'1α.ΔΕΛΤΙΟ ΔΕΔΟΜΕΝΩΝ'!C4*'2.ΒΑΣΙΚΕΣ ΤΙΜΕΣ'!B$54)))","v":0},{"$f":"IF('1α.ΔΕΛΤΙΟ ΔΕΔΟΜΕΝΩΝ'!B4=\"\",0,VLOOKUP('1α.ΔΕΛΤΙΟ ΔΕΔΟΜΕΝΩΝ'!B4,'CS DATA'!D$2:H$13,5,FALSE)*'1α.ΔΕΛΤΙΟ ΔΕΔΟΜΕΝΩΝ'!D4*'1α.ΔΕΛΤΙΟ ΔΕΔΟΜΕΝΩΝ'!C4*'2.ΒΑΣΙΚΕΣ ΤΙΜΕΣ'!D$70)*IF('1α.ΔΕΛΤΙΟ ΔΕΔΟΜΕΝΩΝ'!S4=\"\",0,VLOOKUP('1α.ΔΕΛΤΙΟ ΔΕΔΟΜΕΝΩΝ'!S4,'CS DATA'!A$1:B$13,2,FALSE))","v":0},{"$f":"IF('1α.ΔΕΛΤΙΟ ΔΕΔΟΜΕΝΩΝ'!T4=\"\",0,VLOOKUP('1α.ΔΕΛΤΙΟ ΔΕΔΟΜΕΝΩΝ'!T4,'2.ΒΑΣΙΚΕΣ ΤΙΜΕΣ'!E$64:F$74,2,FALSE)*'1α.ΔΕΛΤΙΟ ΔΕΔΟΜΕΝΩΝ'!C4)*'2.ΒΑΣΙΚΕΣ ΤΙΜΕΣ'!D$71","v":0},{"$f":"IF('1α.ΔΕΛΤΙΟ ΔΕΔΟΜΕΝΩΝ'!B4=\"\",0,VLOOKUP('1α.ΔΕΛΤΙΟ ΔΕΔΟΜΕΝΩΝ'!B4,'2.ΒΑΣΙΚΕΣ ΤΙΜΕΣ'!A$76:B$89,2,FALSE)*'1α.ΔΕΛΤΙΟ ΔΕΔΟΜΕΝΩΝ'!C4)","v":0},{"$f":"SUM(B4:I4)-J4","v":0},null,null,{"$f":"IF('1α.ΔΕΛΤΙΟ ΔΕΔΟΜΕΝΩΝ'!C$23=0,0,'1β.ΜΞΔΠ'!F26*'1α.ΔΕΛΤΙΟ ΔΕΔΟΜΕΝΩΝ'!C4/'1α.ΔΕΛΤΙΟ ΔΕΔΟΜΕΝΩΝ'!C$23)","v":0}]
[3,{"$f":"IF('1α.ΔΕΛΤΙΟ ΔΕΔΟΜΕΝΩΝ'!B5=\"\",0,IF('1α.ΔΕΛΤΙΟ ΔΕΔΟΜΕΝΩΝ'!C5>0,VLOOKUP('1α.ΔΕΛΤΙΟ ΔΕΔΟΜΕΝΩΝ'!B5,'2.ΒΑΣΙΚΕΣ ΤΙΜΕΣ'!A$6:D$18,4,FALSE)*VLOOKUP('1α.ΔΕΛΤΙΟ ΔΕΔΟΜΕΝΩΝ'!B5,'2.ΒΑΣΙΚΕΣ ΤΙΜΕΣ'!A$6:K$18,11,FALSE),0)*'1α.ΔΕΛΤΙΟ ΔΕΔΟΜΕΝΩΝ'!C5*'1α.ΔΕΛΤΙΟ ΔΕΔΟΜΕΝΩΝ'!D5)","v":0},{"$f":"'1α.ΔΕΛΤΙΟ ΔΕΔΟΜΕΝΩΝ'!F5*'2.ΒΑΣΙΚΕΣ ΤΙΜΕΣ'!C$22*'2.ΒΑΣΙΚΕΣ ΤΙΜΕΣ'!D$22*'1α.ΔΕΛΤΙΟ ΔΕΔΟΜΕΝΩΝ'!C5+'1α.ΔΕΛΤΙΟ ΔΕΔΟΜΕΝΩΝ'!C5*'1α.ΔΕΛΤΙΟ ΔΕΔΟΜΕΝΩΝ'!G5*'2.ΒΑΣΙΚΕΣ ΤΙΜΕΣ'!C$25*'2.ΒΑΣΙΚΕΣ ΤΙΜΕΣ'!D$25+'1α.ΔΕΛΤΙΟ ΔΕΔΟΜΕΝΩΝ'!H5*'1α.ΔΕΛΤΙΟ ΔΕΔΟΜΕΝΩΝ'!C5*'2.ΒΑΣΙΚΕΣ ΤΙΜΕΣ'!C$27*'2.ΒΑΣΙΚΕΣ ΤΙΜΕΣ'!D$27*'1α.ΔΕΛΤΙΟ ΔΕΔΟΜΕΝΩΝ'!W5+N5","v":0},{"$f":"IF('1α.ΔΕΛΤΙΟ ΔΕΔΟΜΕΝΩΝ'!B5=\"\",0,VLOOKUP('1α.ΔΕΛΤΙΟ ΔΕΔΟΜΕΝΩΝ'!B5,'2.ΒΑΣΙΚΕΣ ΤΙΜΕΣ'!A$36:B$51,2,FALSE)*('1α.ΔΕΛΤΙΟ ΔΕΔΟΜΕΝΩΝ'!C5-'1α.ΔΕΛΤΙΟ ΔΕΔΟΜΕΝΩΝ'!J5))","v":0},{"$f":"'2.ΒΑΣΙΚΕΣ ΤΙΜΕΣ'!D$36*0.7*('1α.ΔΕΛΤΙΟ ΔΕΔΟΜΕΝΩΝ'!C5-'1α.ΔΕΛΤΙΟ ΔΕΔΟΜΕΝΩΝ'!K5)","v":0},{"$f":"IF('1α.ΔΕΛΤΙΟ ΔΕΔΟΜΕΝΩΝ'!B5=\"\",0,VLOOKUP('1α.ΔΕΛΤΙΟ ΔΕΔΟΜΕΝΩΝ'!B5,'2.ΒΑΣΙΚΕΣ ΤΙΜΕΣ'!A$36:C$51,3,FALSE)*'1α.ΔΕΛΤΙΟ ΔΕΔΟΜΕΝΩΝ'!C5)","v":0},{"$f":"(IF(OR('1α.ΔΕΛΤΙΟ ΔΕΔΟΜΕΝΩΝ'!M5=\"\",'1α.ΔΕΛΤΙΟ ΔΕΔΟΜΕΝΩΝ'!Q5=\"\",'1α.ΔΕΛΤΙΟ ΔΕΔΟΜΕΝΩΝ'!R5=\"\",'1α.ΔΕΛΤΙΟ ΔΕΔΟΜΕΝΩΝ'!R5=\"Επιφάνεια χωρίς φυτοκάλυψη \"),0,IF('1α.ΔΕΛΤΙΟ ΔΕΔΟΜΕΝΩΝ'!M5=0,0,VLOOKUP('1α.ΔΕΛΤΙΟ ΔΕΔΟΜΕΝΩΝ'!M5&'1α.ΔΕΛΤΙΟ ΔΕΔΟΜΕΝΩΝ'!Q5&'1α.ΔΕΛΤΙΟ ΔΕΔΟΜΕΝΩΝ'!R5,'PS DATA'!D:E,2,FALSE)*'1α.ΔΕΛΤΙΟ ΔΕΔΟΜΕΝΩΝ'!C5*'2.ΒΑΣΙΚΕΣ ΤΙΜΕΣ'!B$54)))","v":0},{"$f":"IF('1α.ΔΕΛΤΙΟ ΔΕΔΟΜΕΝΩΝ'!B5=\"\",0,VLOOKUP('1α.ΔΕΛΤΙΟ ΔΕΔΟΜΕΝΩΝ'!B5,'CS DATA'!D$2:H$13,5,FALSE)*'1α.ΔΕΛΤΙΟ ΔΕΔΟΜΕΝΩΝ'!D5*'1α.ΔΕΛΤΙΟ ΔΕΔΟΜΕΝΩΝ'!C5*'2.ΒΑΣΙΚΕΣ ΤΙΜΕΣ'!D$70)*IF('1α.ΔΕΛΤΙΟ ΔΕΔΟΜΕΝΩΝ'!S5=\"\",0,VLOOKUP('1α.ΔΕΛΤΙΟ ΔΕΔΟΜΕΝΩΝ'!S5,'CS DATA'!A$1:B$13,2,FALSE))","v":0},{"$f":"IF('1α.ΔΕΛΤΙΟ ΔΕΔΟΜΕΝΩΝ'!T5=\"\",0,VLOOKUP('1α.ΔΕΛΤΙΟ ΔΕΔΟΜΕΝΩΝ'!T5,'2.ΒΑΣΙΚΕΣ ΤΙΜΕΣ'!E$64:F$74,2,FALSE)*'1α.ΔΕΛΤΙΟ ΔΕΔΟΜΕΝΩΝ'!C5)*'2.ΒΑΣΙΚΕΣ ΤΙΜΕΣ'!D$71","v":0},{"$f":"IF('1α.ΔΕΛΤΙΟ ΔΕΔΟΜΕΝΩΝ'!B5=\"\",0,VLOOKUP('1α.ΔΕΛΤΙΟ ΔΕΔΟΜΕΝΩΝ'!B5,'2.ΒΑΣΙΚΕΣ ΤΙΜΕΣ'!A$76:B$89,2,FALSE)*'1α.ΔΕΛΤΙΟ ΔΕΔΟΜΕΝΩΝ'!C5)","v":0},0,null,null,{"$f":"IF('1α.ΔΕΛΤΙΟ ΔΕΔΟΜΕΝΩΝ'!C$23=0,0,'1β.ΜΞΔΠ'!F27*'1α.ΔΕΛΤΙΟ ΔΕΔΟΜΕΝΩΝ'!C5/'1α.ΔΕΛΤΙΟ ΔΕΔΟΜΕΝΩΝ'!C$23)","v":0}]
[4,{"$f":"IF('1α.ΔΕΛΤΙΟ ΔΕΔΟΜΕΝΩΝ'!B6=\"\",0,IF('1α.ΔΕΛΤΙΟ ΔΕΔΟΜΕΝΩΝ'!C6>0,VLOOKUP('1α.ΔΕΛΤΙΟ ΔΕΔΟΜΕΝΩΝ'!B6,'2.ΒΑΣΙΚΕΣ ΤΙΜΕΣ'!A$6:D$18,4,FALSE)*VLOOKUP('1α.ΔΕΛΤΙΟ ΔΕΔΟΜΕΝΩΝ'!B6,'2.ΒΑΣΙΚΕΣ ΤΙΜΕΣ'!A$6:K$18,11,FALSE),0)*'1α.ΔΕΛΤΙΟ ΔΕΔΟΜΕΝΩΝ'!C6*'1α.ΔΕΛΤΙΟ ΔΕΔΟΜΕΝΩΝ'!D6)","v":0},{"$f":"'1α.ΔΕΛΤΙΟ ΔΕΔΟΜΕΝΩΝ'!F6*'2.ΒΑΣΙΚΕΣ ΤΙΜΕΣ'!C$22*'2.ΒΑΣΙΚΕΣ ΤΙΜΕΣ'!D$22*'1α.ΔΕΛΤΙΟ ΔΕΔΟΜΕΝΩΝ'!C6+'1α.ΔΕΛΤΙΟ ΔΕΔΟΜΕΝΩΝ'!C6*'1α.ΔΕΛΤΙΟ ΔΕΔΟΜΕΝΩΝ'!G6*'2.ΒΑΣΙΚΕΣ ΤΙΜΕΣ'!C$25*'2.ΒΑΣΙΚΕΣ ΤΙΜΕΣ'!D$25+'1α.ΔΕΛΤΙΟ ΔΕΔΟΜΕΝΩΝ'!H6*'1α.ΔΕΛΤΙΟ ΔΕΔΟΜΕΝΩΝ'!C6*'2.ΒΑΣΙΚΕΣ ΤΙΜΕΣ'!C$27*'2.ΒΑΣΙΚΕΣ ΤΙΜΕΣ'!D$27*'1α.ΔΕΛΤΙΟ ΔΕΔΟΜΕΝΩΝ'!W6+N6","v":0},{"$f":"IF('1α.ΔΕΛΤΙΟ ΔΕΔΟΜΕΝΩΝ'!B6=\"\",0,VLOOKUP('1α.ΔΕΛΤΙΟ ΔΕΔΟΜΕΝΩΝ'!B6,'2.ΒΑΣΙΚΕΣ ΤΙΜΕΣ'!A$36:B$51,2,FALSE)*('1α.ΔΕΛΤΙΟ ΔΕΔΟΜΕΝΩΝ'!C6-'1α.ΔΕΛΤΙΟ ΔΕΔΟΜΕΝΩΝ'!J6))","v":0},{"$f":"'2.ΒΑΣΙΚΕΣ ΤΙΜΕΣ'!D$36*0.7*('1α.ΔΕΛΤΙΟ ΔΕΔΟΜΕΝΩΝ'!C6-'1α.ΔΕΛΤΙΟ ΔΕΔΟΜΕΝΩΝ'!K6)","v":0},{"$f":"IF('1α.ΔΕΛΤΙΟ ΔΕΔΟΜΕΝΩΝ'!B6=\"\",0,VLOOKUP('1α.ΔΕΛΤΙΟ ΔΕΔΟΜΕΝΩΝ'!B6,'2.ΒΑΣΙΚΕΣ ΤΙΜΕΣ'!A$36:C$51,3,FALSE)*'1α.ΔΕΛΤΙΟ ΔΕΔΟΜΕΝΩΝ'!C6)","v":0},{"$f":"(IF(OR('1α.ΔΕΛΤΙΟ ΔΕΔΟΜΕΝΩΝ'!M6=\"\",'1α.ΔΕΛΤΙΟ ΔΕΔΟΜΕΝΩΝ'!Q6=\"\",'1α.ΔΕΛΤΙΟ ΔΕΔΟΜΕΝΩΝ'!R6=\"\",'1α.ΔΕΛΤΙΟ ΔΕΔΟΜΕΝΩΝ'!R6=\"Επιφάνεια χωρίς φυτοκάλυψη \"),0,IF('1α.ΔΕΛΤΙΟ ΔΕΔΟΜΕΝΩΝ'!M6=0,0,VLOOKUP('1α.ΔΕΛΤΙΟ ΔΕΔΟΜΕΝΩΝ'!M6&'1α.ΔΕΛΤΙΟ ΔΕΔΟΜΕΝΩΝ'!Q6&'1α.ΔΕΛΤΙΟ ΔΕΔΟΜΕΝΩΝ'!R6,'PS DATA'!D:E,2,FALSE)*'1α.ΔΕΛΤΙΟ ΔΕΔΟΜΕΝΩΝ'!C6*'2.ΒΑΣΙΚΕΣ ΤΙΜΕΣ'!B$54)))","v":0},{"$f":"IF('1α.ΔΕΛΤΙΟ ΔΕΔΟΜΕΝΩΝ'!B6=\"\",0,VLOOKUP('1α.ΔΕΛΤΙΟ ΔΕΔΟΜΕΝΩΝ'!B6,'CS DATA'!D$2:H$13,5,FALSE)*'1α.ΔΕΛΤΙΟ ΔΕΔΟΜΕΝΩΝ'!D6*'1α.ΔΕΛΤΙΟ ΔΕΔΟΜΕΝΩΝ'!C6*'2.ΒΑΣΙΚΕΣ ΤΙΜΕΣ'!D$70)*IF('1α.ΔΕΛΤΙΟ ΔΕΔΟΜΕΝΩΝ'!S6=\"\",0,VLOOKUP('1α.ΔΕΛΤΙΟ ΔΕΔΟΜΕΝΩΝ'!S6,'CS DATA'!A$1:B$13,2,FALSE))","v":0},{"$f":"IF('1α.ΔΕΛΤΙΟ ΔΕΔΟΜΕΝΩΝ'!T6=\"\",0,VLOOKUP('1α.ΔΕΛΤΙΟ ΔΕΔΟΜΕΝΩΝ'!T6,'2.ΒΑΣΙΚΕΣ ΤΙΜΕΣ'!E$64:F$74,2,FALSE)*'1α.ΔΕΛΤΙΟ ΔΕΔΟΜΕΝΩΝ'!C6)*'2.ΒΑΣΙΚΕΣ ΤΙΜΕΣ'!D$71","v":0},{"$f":"IF('1α.ΔΕΛΤΙΟ ΔΕΔΟΜΕΝΩΝ'!B6=\"\",0,VLOOKUP('1α.ΔΕΛΤΙΟ ΔΕΔΟΜΕΝΩΝ'!B6,'2.ΒΑΣΙΚΕΣ ΤΙΜΕΣ'!A$76:B$89,2,FALSE)*'1α.ΔΕΛΤΙΟ ΔΕΔΟΜΕΝΩΝ'!C6)","v":0},0,null,null,{"$f":"IF('1α.ΔΕΛΤΙΟ ΔΕΔΟΜΕΝΩΝ'!C$23=0,0,'1β.ΜΞΔΠ'!F28*'1α.ΔΕΛΤΙΟ ΔΕΔΟΜΕΝΩΝ'!C6/'1α.ΔΕΛΤΙΟ ΔΕΔΟΜΕΝΩΝ'!C$23)","v":0}]
{"$rows_left_out":24}
{"sheet":"3β.ΤΕΚΜΗΡΙΩΣΗ","index":5,"n_rows":57,"n_cols":7,"rows_kept":57,"cut":false,"hidden":false,"merged":[[43,5,46,5],[53,3,53,5],[53,1,54,1],[52,0,52,5],[29,1,30,1],[29,0,30,0],[21,3,21,4],[1,3,1,5],[4,0,4,5],[28,0,28,6],[41,3,41,5],[41,1,42,1],[41,0,42,0],[5,5,6,5],[5,3,5,4],[5,1,6,1],[5,0,6,0],[24,1,26,3],[23,1,23,3],[19,3,19,4],[20,3,20,4]]}
["ΔΕΛΤΙΟ ΤΕΚΜΗΡΙΩΣΗΣ ΤΗΣ ΑΠΟΤΙΜΗΣΗΣ ΤΗΣ ΑΞΙΑΣ ΔΑΣΙΚΗΣ ΓΗΣ"]
["Δάσος ή δασική θέση:"]
["Συνολική έκταση: ",null,null,{"$f":"'1α.ΔΕΛΤΙΟ ΔΕΔΟΜΕΝΩΝ'!C23","v":0},"ha"]
[]
["Α. ΥΠΟΛΟΓΙΖΟΜΕΝΗ ΑΞΙΑ ΤΗΣ ΔΑΣΙΚΗΣ ΓΗΣ"]
["α/α","Λειτουργία",null,"Ετήσια αξία σε",null,"%"]
{"$rows_left_out":52}
{"sheet":"PS DATA","index":6,"n_rows":101,"n_cols":5,"rows_kept":101,"cut":false,"hidden":true,"merged":[]}
["ΚΛΙΣΗ","ΓΕΩΛΟΓΙΚΟΙ ΣΧΗΜΑΤΙΣΜΟΙ","ΒΛΑΣΤΗΣΗ","CODE","ΤΙΜΗ S"]
["0-25%","Σκληρά πετρώματα, ανθεκτικά στη διάβρωση","Μικτές δασοσυστάδες και πυκνοί θαμνώνες ή δασοσυστάδες αραιές με υπόροφο ",{"$f":"A2&B2&C2","v":"0-25%Σκληρά πετρώματα, ανθεκτικά στη διάβρωσηΜικτές δασοσυστάδες και πυκνοί θαμνώνες ή δασοσυστάδες αραιές με υπόροφο "},3.16]
["0-25%","Σκληρά πετρώματα, ανθεκτικά στη διάβρωση","Δασοσυστάδες κωνοφόρων με υπόροφο ασθενή ή θαμνώνες όχι σύμπυκνοι ",{"$f":"A3&B3&C3","v":"0-25%Σκληρά πετρώματα, ανθεκτικά στη διάβρωσηΔασοσυστάδες κωνοφόρων με υπόροφο ασθενή ή θαμνώνες όχι σύμπυκνοι "},2.93]
["0-25%","Σκληρά πετρώματα, ανθεκτικά στη διάβρωση","Δασοσυστάδες και θαμνώνες υποβαθμισμένοι, λιβάδια ","0-25%Σκληρά πετρώματα, ανθεκτικά στη διάβρωσηΔασοσυστάδες και θαμνώνες υποβαθμισμένοι, λιβάδια ",2.44]
["0-25%","Σκληρά πετρώματα, ανθεκτικά στη διάβρωση","Λιβάδια και εδάφη καλλιεργούμενα, υποβαθμισμένα ","0-25%Σκληρά πετρώματα, ανθεκτικά στη διάβρωσηΛιβάδια και εδάφη καλλιεργούμενα, υποβαθμισμένα ",1.31]
["25-40%","Σκληρά πετρώματα, ανθεκτικά στη διάβρωση","Μικτές δασοσυστάδες και πυκνοί θαμνώνες ή δασοσυστάδες αραιές με υπόροφο ","25-40%Σκληρά πετρώματα, ανθεκτικά στη διάβρωσηΜικτές δασοσυστάδες και πυκνοί θαμνώνες ή δασοσυστάδες αραιές με υπόροφο ",4.6100000000000003]
{"$rows_left_out":96}
{"sheet":"CS DATA","index":7,"n_rows":13,"n_cols":8,"rows_kept":13,"cut":false,"hidden":true,"merged":[]}
["Συντελεστές BEF","t/m3",null,"Δασικά είδη","MAI-Vp","R","MACI","GINOMENO"]
["A (Δάση σφενδάμου\nΥγρόφιλα παρόχθια δάση\nΥψηλά δάση δρυός σε χαμηλά υψόμετρα\nΥψηλά δάση οξυάς ή σημύδας)",0.8,null,"Ελάτη",{"$f":"'2.ΒΑΣΙΚΕΣ ΤΙΜΕΣ'!M64","v":5.05},{"$f":"'2.ΒΑΣΙΚΕΣ ΤΙΜΕΣ'!L64","v":0.46},0.5,{"$f":"E2*(1+F2)*G2","v":3.6864999999999997}]
["B (Υψηλά δάση δρυός (Q. petreae, Q.pubescens, Q.cerris)\nΑειθαλή υψηλά δάση δρυός)",0.95,null,"Ερυθρελάτη",{"$f":"'2.ΒΑΣΙΚΕΣ ΤΙΜΕΣ'!M65","v":2.8499999999999996},{"$f":"F2","v":0.46},{"$f":"G2","v":0.5},{"$f":"E3*(1+F3)*G3","v":2.0804999999999998}]
["C (Δάση ερυθρελάτης ή ελάτης\nΜεικτά δάση ελάτης και ερυθρελάτης\nΔάση δασικής ή μαύρης πεύκης)",0.6,null,"Πεύκη Χαλέπιος ή Τραχεία",{"$f":"'2.ΒΑΣΙΚΕΣ ΤΙΜΕΣ'!M66","v":5.57},{"$f":"F3","v":0.46},{"$f":"G3","v":0.5},4.0661000000000005]
["D (Λοφώδη και επίπεδα δάση δασικής πεύκης\nΔάση τραχείας και λευκόδερμου πεύκης \nΛοφώδη δάση μαύρης πεύκης\nΜεσογειακά δάση πεύκης\nΆλλα δάση κωνοφόρων)",0.7,null,"Πεύκη λοιπά",{"$f":"E4","v":5.57},{"$f":"F4","v":0.46},0.5,4.0661000000000005]
["E (Πρεμνοφυή δάση οξυάς ή καστανιάς ή γαύρου)",0.8,null,"Οξυά",{"$f":"'2.ΒΑΣΙΚΕΣ ΤΙΜΕΣ'!M67","v":5.4399999999999995},{"$f":"'2.ΒΑΣΙΚΕΣ ΤΙΜΕΣ'!L67","v":0.43},0.5,3.8895999999999993]
{"$rows_left_out":8}
{"sheet":"5.ΥΠΟΛΟΓΙΣΜΟΙ","index":8,"n_rows":38,"n_cols":13,"rows_kept":38,"cut":false,"hidden":true,"merged":[[31,0,31,5],[0,0,0,8],[3,0,3,5],[10,0,10,5],[17,0,17,5],[24,0,24,5]]}
["5. ΒΟΗΘΗΤΙΚΟΙ ΥΠΟΛΟΓΙΣΜΟΙ ΤΙΜΩΝ"]
[]
["Α) ΕΠΙΛΟΓΗ ΤΙΜΗΣ S",null,null,null,null,null,null,"Β) ΕΚΤΙΜΗΣΗ ΑΞΙΑΣ ΑΠΌ ΔΕΣΜΕΥΣΗ ΑΝΘΡΑΚΑ"]
["Σκληρά πετρώματα, ανθεκτικά στη διάβρωση",null,null,null,null,null,null,null,"ha","MAI-Vv","BEF","R","Vb"]
["Κλίση (%)","Α","Β","Γ","Δ","Ε",null,"Ελάτη",{"$f":"#REF!","v":{"$error":"#REF!"}},{"$f":"'2.ΒΑΣΙΚΕΣ ΤΙΜΕΣ'!D6-'2.ΒΑΣΙΚΕΣ ΤΙΜΕΣ'!K64","v":5.05},{"$f":"'2.ΒΑΣΙΚΕΣ ΤΙΜΕΣ'!B66","v":0.6},0.46,{"$f":"I5*J5*K5*0.5*'2.ΒΑΣΙΚΕΣ ΤΙΜΕΣ'!D$70","v":{"$error":"#REF!"}}]
["0-25%",3.16,2.93,2.44,1.31,0,null,"Ερυθρελάτη",{"$f":"#REF!","v":{"$error":"#REF!"}},{"$f":"'2.ΒΑΣΙΚΕΣ ΤΙΜΕΣ'!D7-'2.ΒΑΣΙΚΕΣ ΤΙΜΕΣ'!K65","v":2.8499999999999996},{"$f":"K5","v":0.6},0.46,{"$f":"I6*J6*K6*0.5*'2.ΒΑΣΙΚΕΣ ΤΙΜΕΣ'!D$70","v":{"$error":"#REF!"}}]
{"$rows_left_out":32}